BDBM50230390 CHEBI:48556::MEDETOMIDINE HYDROCHLORIDE::MPV-785::Medetomidine HCl
SMILES Cl.CC(c1c[nH]cn1)c1cccc(C)c1C
InChI Key InChIKey=VPNGEIHDPSLNMU-UHFFFAOYSA-N
Data  1 IC50  1 EC50
  Tab Delimited (TSV)   2D SDfile   Computed 3D by Vconf -m prep SDfile
Find this compound or compounds like it in BindingDB:
Activity Spreadsheet -- Enzyme Inhibition Constant Data from BindingDB
Found 1 hit for monomerid = 50230390
TargetAlpha-2A/Alpha-2B/Alpha-2C adrenergic receptor(Homo sapiens (Human))
Ohio State University
Curated by ChEMBL
LigandPNGBDBM50230390(CHEBI:48556 | MEDETOMIDINE HYDROCHLORIDE | MPV-785...)
Affinity DataIC50:  3.30E+3nM. Assay description: Compound was evaluated for Adrenergic activity in Alpha-2 adrenergic receptor of human platelets
In DepthDetails ArticlePubMed